dev@jersey.java.net

Build failed in Hudson: Jersey #2144

From: Hudson <hudson-admins_at_sun.com>
Date: Sat, 25 Jul 2009 02:19:37 -0700 (PDT)

See <http://hudson.sfbay/job/Jersey/2144/changes>

Changes:

[japod] no timestamps at oauth javadocs

------------------------------------------
[...truncated 65947 lines...]
Running com.sun.jersey.impl.subresources.SubResourceDynamicWithParametersTest
Jul 25, 2009 2:17:53 AM com.sun.jersey.server.impl.application.WebApplicationImpl initiate
INFO: Initiating Jersey application, version 'Jersey: 1.1.2-ea-SNAPSHOT 07/25/2009 01:34 AM'
Jul 25, 2009 2:17:55 AM com.sun.jersey.server.impl.application.WebApplicationImpl initiate
INFO: Initiating Jersey application, version 'Jersey: 1.1.2-ea-SNAPSHOT 07/25/2009 01:34 AM'
Tests run: 2, Failures: 0, Errors: 0, Skipped: 0, Time elapsed: 3.104 sec
Running com.sun.jersey.impl.InfectorTest
Tests run: 1, Failures: 0, Errors: 0, Skipped: 0, Time elapsed: 0.079 sec
Running com.sun.jersey.impl.methodparams.MatrixParamAsStringTest
Jul 25, 2009 2:17:57 AM com.sun.jersey.server.impl.application.WebApplicationImpl initiate
INFO: Initiating Jersey application, version 'Jersey: 1.1.2-ea-SNAPSHOT 07/25/2009 01:34 AM'
Jul 25, 2009 2:17:59 AM com.sun.jersey.server.impl.application.WebApplicationImpl initiate
INFO: Initiating Jersey application, version 'Jersey: 1.1.2-ea-SNAPSHOT 07/25/2009 01:34 AM'
Jul 25, 2009 2:18:00 AM com.sun.jersey.server.impl.application.WebApplicationImpl initiate
INFO: Initiating Jersey application, version 'Jersey: 1.1.2-ea-SNAPSHOT 07/25/2009 01:34 AM'
Jul 25, 2009 2:18:00 AM com.sun.jersey.server.impl.application.WebApplicationImpl initiate
INFO: Initiating Jersey application, version 'Jersey: 1.1.2-ea-SNAPSHOT 07/25/2009 01:34 AM'
Jul 25, 2009 2:18:01 AM com.sun.jersey.server.impl.application.WebApplicationImpl initiate
INFO: Initiating Jersey application, version 'Jersey: 1.1.2-ea-SNAPSHOT 07/25/2009 01:34 AM'
Jul 25, 2009 2:18:02 AM com.sun.jersey.server.impl.application.WebApplicationImpl initiate
INFO: Initiating Jersey application, version 'Jersey: 1.1.2-ea-SNAPSHOT 07/25/2009 01:34 AM'
Jul 25, 2009 2:18:02 AM com.sun.jersey.server.impl.application.WebApplicationImpl initiate
INFO: Initiating Jersey application, version 'Jersey: 1.1.2-ea-SNAPSHOT 07/25/2009 01:34 AM'
Jul 25, 2009 2:18:03 AM com.sun.jersey.server.impl.application.WebApplicationImpl initiate
INFO: Initiating Jersey application, version 'Jersey: 1.1.2-ea-SNAPSHOT 07/25/2009 01:34 AM'
Jul 25, 2009 2:18:03 AM com.sun.jersey.server.impl.application.WebApplicationImpl initiate
INFO: Initiating Jersey application, version 'Jersey: 1.1.2-ea-SNAPSHOT 07/25/2009 01:34 AM'
Jul 25, 2009 2:18:04 AM com.sun.jersey.server.impl.application.WebApplicationImpl initiate
INFO: Initiating Jersey application, version 'Jersey: 1.1.2-ea-SNAPSHOT 07/25/2009 01:34 AM'
Jul 25, 2009 2:18:04 AM com.sun.jersey.server.impl.application.WebApplicationImpl initiate
INFO: Initiating Jersey application, version 'Jersey: 1.1.2-ea-SNAPSHOT 07/25/2009 01:34 AM'
Jul 25, 2009 2:18:05 AM com.sun.jersey.server.impl.application.WebApplicationImpl initiate
INFO: Initiating Jersey application, version 'Jersey: 1.1.2-ea-SNAPSHOT 07/25/2009 01:34 AM'
Jul 25, 2009 2:18:05 AM com.sun.jersey.server.impl.application.WebApplicationImpl initiate
INFO: Initiating Jersey application, version 'Jersey: 1.1.2-ea-SNAPSHOT 07/25/2009 01:34 AM'
Jul 25, 2009 2:18:05 AM com.sun.jersey.server.impl.application.WebApplicationImpl initiate
INFO: Initiating Jersey application, version 'Jersey: 1.1.2-ea-SNAPSHOT 07/25/2009 01:34 AM'
Jul 25, 2009 2:18:06 AM com.sun.jersey.server.impl.application.WebApplicationImpl initiate
INFO: Initiating Jersey application, version 'Jersey: 1.1.2-ea-SNAPSHOT 07/25/2009 01:34 AM'
Tests run: 15, Failures: 0, Errors: 0, Skipped: 0, Time elapsed: 9.175 sec
Running com.sun.jersey.impl.lifecycle.SingletonLifecycleTest
Jul 25, 2009 2:18:07 AM com.sun.jersey.server.impl.application.WebApplicationImpl initiate
INFO: Initiating Jersey application, version 'Jersey: 1.1.2-ea-SNAPSHOT 07/25/2009 01:34 AM'
Jul 25, 2009 2:18:09 AM com.sun.jersey.server.impl.application.WebApplicationImpl initiate
INFO: Initiating Jersey application, version 'Jersey: 1.1.2-ea-SNAPSHOT 07/25/2009 01:34 AM'
Jul 25, 2009 2:18:10 AM com.sun.jersey.server.impl.application.WebApplicationImpl initiate
INFO: Initiating Jersey application, version 'Jersey: 1.1.2-ea-SNAPSHOT 07/25/2009 01:34 AM'
Tests run: 3, Failures: 0, Errors: 0, Skipped: 0, Time elapsed: 3.247 sec
Running com.sun.jersey.impl.client.filter.ConnectionListenerTest
Jul 25, 2009 2:18:11 AM com.sun.jersey.server.impl.application.WebApplicationImpl initiate
INFO: Initiating Jersey application, version 'Jersey: 1.1.2-ea-SNAPSHOT 07/25/2009 01:34 AM'
Starting GrizzlyServer port number = 49703
Started GrizzlyServer
Sleeping for 2000 ms
Jul 25, 2009 2:18:17 AM com.sun.jersey.server.impl.application.WebApplicationImpl initiate
INFO: Initiating Jersey application, version 'Jersey: 1.1.2-ea-SNAPSHOT 07/25/2009 01:34 AM'
Starting GrizzlyServer port number = 49703
Started GrizzlyServer
Sleeping for 2000 ms
Tests run: 2, Failures: 0, Errors: 0, Skipped: 0, Time elapsed: 9.395 sec
Running com.sun.jersey.impl.entity.XXETest
Jul 25, 2009 2:18:22 AM com.sun.jersey.server.impl.application.WebApplicationImpl initiate
INFO: Initiating Jersey application, version 'Jersey: 1.1.2-ea-SNAPSHOT 07/25/2009 01:34 AM'
Jul 25, 2009 2:18:24 AM com.sun.jersey.server.impl.application.WebApplicationImpl initiate
INFO: Initiating Jersey application, version 'Jersey: 1.1.2-ea-SNAPSHOT 07/25/2009 01:34 AM'
Jul 25, 2009 2:18:24 AM com.sun.jersey.server.impl.application.WebApplicationImpl initiate
INFO: Initiating Jersey application, version 'Jersey: 1.1.2-ea-SNAPSHOT 07/25/2009 01:34 AM'
Jul 25, 2009 2:18:25 AM com.sun.jersey.server.impl.application.WebApplicationImpl initiate
INFO: Initiating Jersey application, version 'Jersey: 1.1.2-ea-SNAPSHOT 07/25/2009 01:34 AM'
Jul 25, 2009 2:18:26 AM com.sun.jersey.server.impl.application.WebApplicationImpl initiate
INFO: Initiating Jersey application, version 'Jersey: 1.1.2-ea-SNAPSHOT 07/25/2009 01:34 AM'
Jul 25, 2009 2:18:26 AM com.sun.jersey.server.impl.application.WebApplicationImpl initiate
INFO: Initiating Jersey application, version 'Jersey: 1.1.2-ea-SNAPSHOT 07/25/2009 01:34 AM'
Jul 25, 2009 2:18:27 AM com.sun.jersey.server.impl.application.WebApplicationImpl initiate
INFO: Initiating Jersey application, version 'Jersey: 1.1.2-ea-SNAPSHOT 07/25/2009 01:34 AM'
Jul 25, 2009 2:18:27 AM com.sun.jersey.server.impl.application.WebApplicationImpl initiate
INFO: Initiating Jersey application, version 'Jersey: 1.1.2-ea-SNAPSHOT 07/25/2009 01:34 AM'
Jul 25, 2009 2:18:28 AM com.sun.jersey.server.impl.application.WebApplicationImpl initiate
INFO: Initiating Jersey application, version 'Jersey: 1.1.2-ea-SNAPSHOT 07/25/2009 01:34 AM'
Jul 25, 2009 2:18:28 AM com.sun.jersey.server.impl.application.WebApplicationImpl initiate
INFO: Initiating Jersey application, version 'Jersey: 1.1.2-ea-SNAPSHOT 07/25/2009 01:34 AM'
Jul 25, 2009 2:18:29 AM com.sun.jersey.server.impl.application.WebApplicationImpl initiate
INFO: Initiating Jersey application, version 'Jersey: 1.1.2-ea-SNAPSHOT 07/25/2009 01:34 AM'
Jul 25, 2009 2:18:29 AM com.sun.jersey.server.impl.application.WebApplicationImpl initiate
INFO: Initiating Jersey application, version 'Jersey: 1.1.2-ea-SNAPSHOT 07/25/2009 01:34 AM'
Jul 25, 2009 2:18:30 AM com.sun.jersey.server.impl.application.WebApplicationImpl initiate
INFO: Initiating Jersey application, version 'Jersey: 1.1.2-ea-SNAPSHOT 07/25/2009 01:34 AM'
Jul 25, 2009 2:18:30 AM com.sun.jersey.server.impl.application.WebApplicationImpl initiate
INFO: Initiating Jersey application, version 'Jersey: 1.1.2-ea-SNAPSHOT 07/25/2009 01:34 AM'
Tests run: 14, Failures: 0, Errors: 0, Skipped: 0, Time elapsed: 9.155 sec
Running com.sun.jersey.impl.methodparams.HeaderParamAsStringTest
Jul 25, 2009 2:18:32 AM com.sun.jersey.server.impl.application.WebApplicationImpl initiate
INFO: Initiating Jersey application, version 'Jersey: 1.1.2-ea-SNAPSHOT 07/25/2009 01:34 AM'
Jul 25, 2009 2:18:34 AM com.sun.jersey.server.impl.application.WebApplicationImpl initiate
INFO: Initiating Jersey application, version 'Jersey: 1.1.2-ea-SNAPSHOT 07/25/2009 01:34 AM'
Jul 25, 2009 2:18:34 AM com.sun.jersey.server.impl.application.WebApplicationImpl initiate
INFO: Initiating Jersey application, version 'Jersey: 1.1.2-ea-SNAPSHOT 07/25/2009 01:34 AM'
Jul 25, 2009 2:18:35 AM com.sun.jersey.server.impl.application.WebApplicationImpl initiate
INFO: Initiating Jersey application, version 'Jersey: 1.1.2-ea-SNAPSHOT 07/25/2009 01:34 AM'
Jul 25, 2009 2:18:35 AM com.sun.jersey.server.impl.application.WebApplicationImpl initiate
INFO: Initiating Jersey application, version 'Jersey: 1.1.2-ea-SNAPSHOT 07/25/2009 01:34 AM'
Jul 25, 2009 2:18:36 AM com.sun.jersey.server.impl.application.WebApplicationImpl initiate
INFO: Initiating Jersey application, version 'Jersey: 1.1.2-ea-SNAPSHOT 07/25/2009 01:34 AM'
Jul 25, 2009 2:18:36 AM com.sun.jersey.server.impl.application.WebApplicationImpl initiate
INFO: Initiating Jersey application, version 'Jersey: 1.1.2-ea-SNAPSHOT 07/25/2009 01:34 AM'
Jul 25, 2009 2:18:37 AM com.sun.jersey.server.impl.application.WebApplicationImpl initiate
INFO: Initiating Jersey application, version 'Jersey: 1.1.2-ea-SNAPSHOT 07/25/2009 01:34 AM'
Jul 25, 2009 2:18:37 AM com.sun.jersey.server.impl.application.WebApplicationImpl initiate
INFO: Initiating Jersey application, version 'Jersey: 1.1.2-ea-SNAPSHOT 07/25/2009 01:34 AM'
Jul 25, 2009 2:18:38 AM com.sun.jersey.server.impl.application.WebApplicationImpl initiate
INFO: Initiating Jersey application, version 'Jersey: 1.1.2-ea-SNAPSHOT 07/25/2009 01:34 AM'
Jul 25, 2009 2:18:38 AM com.sun.jersey.server.impl.application.WebApplicationImpl initiate
INFO: Initiating Jersey application, version 'Jersey: 1.1.2-ea-SNAPSHOT 07/25/2009 01:34 AM'
Jul 25, 2009 2:18:39 AM com.sun.jersey.server.impl.application.WebApplicationImpl initiate
INFO: Initiating Jersey application, version 'Jersey: 1.1.2-ea-SNAPSHOT 07/25/2009 01:34 AM'
Jul 25, 2009 2:18:39 AM com.sun.jersey.server.impl.application.WebApplicationImpl initiate
INFO: Initiating Jersey application, version 'Jersey: 1.1.2-ea-SNAPSHOT 07/25/2009 01:34 AM'
Jul 25, 2009 2:18:40 AM com.sun.jersey.server.impl.application.WebApplicationImpl initiate
INFO: Initiating Jersey application, version 'Jersey: 1.1.2-ea-SNAPSHOT 07/25/2009 01:34 AM'
Jul 25, 2009 2:18:40 AM com.sun.jersey.server.impl.application.WebApplicationImpl initiate
INFO: Initiating Jersey application, version 'Jersey: 1.1.2-ea-SNAPSHOT 07/25/2009 01:34 AM'
Tests run: 15, Failures: 0, Errors: 0, Skipped: 0, Time elapsed: 9.05 sec
Running com.sun.jersey.impl.methodparams.FormParamTest
Jul 25, 2009 2:18:42 AM com.sun.jersey.server.impl.application.WebApplicationImpl initiate
INFO: Initiating Jersey application, version 'Jersey: 1.1.2-ea-SNAPSHOT 07/25/2009 01:34 AM'
Jul 25, 2009 2:18:43 AM com.sun.jersey.server.impl.application.WebApplicationImpl initiate
INFO: Initiating Jersey application, version 'Jersey: 1.1.2-ea-SNAPSHOT 07/25/2009 01:34 AM'
Jul 25, 2009 2:18:44 AM com.sun.jersey.server.impl.application.WebApplicationImpl initiate
INFO: Initiating Jersey application, version 'Jersey: 1.1.2-ea-SNAPSHOT 07/25/2009 01:34 AM'
Jul 25, 2009 2:18:45 AM com.sun.jersey.server.impl.application.WebApplicationImpl initiate
INFO: Initiating Jersey application, version 'Jersey: 1.1.2-ea-SNAPSHOT 07/25/2009 01:34 AM'
Jul 25, 2009 2:18:45 AM com.sun.jersey.server.impl.application.WebApplicationImpl initiate
INFO: Initiating Jersey application, version 'Jersey: 1.1.2-ea-SNAPSHOT 07/25/2009 01:34 AM'
Jul 25, 2009 2:18:46 AM com.sun.jersey.server.impl.application.WebApplicationImpl initiate
INFO: Initiating Jersey application, version 'Jersey: 1.1.2-ea-SNAPSHOT 07/25/2009 01:34 AM'
Jul 25, 2009 2:18:46 AM com.sun.jersey.server.impl.application.WebApplicationImpl initiate
INFO: Initiating Jersey application, version 'Jersey: 1.1.2-ea-SNAPSHOT 07/25/2009 01:34 AM'
Jul 25, 2009 2:18:47 AM com.sun.jersey.server.impl.application.WebApplicationImpl initiate
INFO: Initiating Jersey application, version 'Jersey: 1.1.2-ea-SNAPSHOT 07/25/2009 01:34 AM'
Jul 25, 2009 2:18:47 AM com.sun.jersey.server.impl.application.WebApplicationImpl initiate
INFO: Initiating Jersey application, version 'Jersey: 1.1.2-ea-SNAPSHOT 07/25/2009 01:34 AM'
Tests run: 9, Failures: 0, Errors: 0, Skipped: 0, Time elapsed: 6.558 sec
Running com.sun.jersey.impl.entity.ParameterTypeArgumentOrderTest
Jul 25, 2009 2:18:49 AM com.sun.jersey.server.impl.application.WebApplicationImpl initiate
INFO: Initiating Jersey application, version 'Jersey: 1.1.2-ea-SNAPSHOT 07/25/2009 01:34 AM'
Jul 25, 2009 2:18:51 AM com.sun.jersey.server.impl.application.WebApplicationImpl initiate
INFO: Initiating Jersey application, version 'Jersey: 1.1.2-ea-SNAPSHOT 07/25/2009 01:34 AM'
Jul 25, 2009 2:18:51 AM com.sun.jersey.server.impl.application.WebApplicationImpl initiate
INFO: Initiating Jersey application, version 'Jersey: 1.1.2-ea-SNAPSHOT 07/25/2009 01:34 AM'
Jul 25, 2009 2:18:52 AM com.sun.jersey.server.impl.application.WebApplicationImpl initiate
INFO: Initiating Jersey application, version 'Jersey: 1.1.2-ea-SNAPSHOT 07/25/2009 01:34 AM'
Tests run: 4, Failures: 0, Errors: 0, Skipped: 0, Time elapsed: 3.81 sec
Running com.sun.jersey.impl.client.AsyncHttpMethodTest
Jul 25, 2009 2:18:54 AM com.sun.jersey.server.impl.application.WebApplicationImpl initiate
INFO: Initiating Jersey application, version 'Jersey: 1.1.2-ea-SNAPSHOT 07/25/2009 01:34 AM'
Starting GrizzlyServer port number = 49703
Started GrizzlyServer
Sleeping for 2000 ms
Jul 25, 2009 2:19:00 AM com.sun.jersey.server.impl.application.WebApplicationImpl initiate
INFO: Initiating Jersey application, version 'Jersey: 1.1.2-ea-SNAPSHOT 07/25/2009 01:34 AM'
Starting GrizzlyServer port number = 49703
Started GrizzlyServer
Sleeping for 2000 ms
Jul 25, 2009 2:19:05 AM com.sun.jersey.server.impl.application.WebApplicationImpl initiate
INFO: Initiating Jersey application, version 'Jersey: 1.1.2-ea-SNAPSHOT 07/25/2009 01:34 AM'
Starting GrizzlyServer port number = 49703
Started GrizzlyServer
Sleeping for 2000 ms
Jul 25, 2009 2:19:09 AM com.sun.jersey.server.impl.application.WebApplicationImpl initiate
INFO: Initiating Jersey application, version 'Jersey: 1.1.2-ea-SNAPSHOT 07/25/2009 01:34 AM'
Starting GrizzlyServer port number = 49703
Started GrizzlyServer
Sleeping for 2000 ms
Jul 25, 2009 2:19:14 AM com.sun.jersey.server.impl.application.WebApplicationImpl initiate
INFO: Initiating Jersey application, version 'Jersey: 1.1.2-ea-SNAPSHOT 07/25/2009 01:34 AM'
Starting GrizzlyServer port number = 49703
Started GrizzlyServer
Sleeping for 2000 ms
Jul 25, 2009 2:19:22 AM com.sun.jersey.server.impl.application.WebApplicationImpl initiate
INFO: Initiating Jersey application, version 'Jersey: 1.1.2-ea-SNAPSHOT 07/25/2009 01:34 AM'
Starting GrizzlyServer port number = 49703
Started GrizzlyServer
Sleeping for 2000 ms
Tests run: 6, Failures: 0, Errors: 0, Skipped: 0, Time elapsed: 33.356 sec
Running com.sun.jersey.impl.resource.EmptyPathSegSRMTest
Jul 25, 2009 2:19:28 AM com.sun.jersey.server.impl.application.WebApplicationImpl initiate
INFO: Initiating Jersey application, version 'Jersey: 1.1.2-ea-SNAPSHOT 07/25/2009 01:34 AM'
Jul 25, 2009 2:19:29 AM com.sun.jersey.server.impl.application.WebApplicationImpl newResourceClass
WARNING: A sub-resource method, public java.lang.String com.sun.jersey.impl.resource.EmptyPathSegSRMTest$Resource3.get(), with URI template, "", is treated as a resource method
Jul 25, 2009 2:19:29 AM com.sun.jersey.server.impl.application.WebApplicationImpl newResourceClass
WARNING: A sub-resource method, public java.lang.String com.sun.jersey.impl.resource.EmptyPathSegSRMTest$SlashResource.get(), with URI template, "/", is treated as a resource method
Tests run: 1, Failures: 0, Errors: 0, Skipped: 0, Time elapsed: 2.116 sec
Running com.sun.jersey.impl.template.ImplicitProducesTemplateProcessorTest
Jul 25, 2009 2:19:31 AM com.sun.jersey.server.impl.application.WebApplicationImpl initiate
INFO: Initiating Jersey application, version 'Jersey: 1.1.2-ea-SNAPSHOT 07/25/2009 01:34 AM'
Jul 25, 2009 2:19:32 AM com.sun.jersey.server.impl.application.WebApplicationImpl newResourceClass
WARNING: A resource class, class com.sun.jersey.impl.template.ImplicitProducesTemplateProcessorTest$ImplicitTemplate, does not have any resource method, sub-resource method, or sub-resource locator.
Jul 25, 2009 2:19:33 AM com.sun.jersey.server.impl.application.WebApplicationImpl initiate
INFO: Initiating Jersey application, version 'Jersey: 1.1.2-ea-SNAPSHOT 07/25/2009 01:34 AM'
Jul 25, 2009 2:19:33 AM com.sun.jersey.server.impl.application.WebApplicationImpl initiate
INFO: Initiating Jersey application, version 'Jersey: 1.1.2-ea-SNAPSHOT 07/25/2009 01:34 AM'
Tests run: 3, Failures: 0, Errors: 0, Skipped: 0, Time elapsed: 3.268 sec

Results :

Tests in error:

Tests run: 1062, Failures: 0, Errors: 7, Skipped: 0

[INFO] ------------------------------------------------------------------------
[ERROR] BUILD FAILURE
[INFO] ------------------------------------------------------------------------
[INFO] There are test failures.

Please refer to /home/hudson/workspace/Jersey/jersey/jersey-tests/target/surefire-reports for the individual test results.
[INFO] ------------------------------------------------------------------------
[INFO] Trace
org.apache.maven.BuildFailureException: There are test failures.

Please refer to /home/hudson/workspace/Jersey/jersey/jersey-tests/target/surefire-reports for the individual test results.
        at org.apache.maven.lifecycle.DefaultLifecycleExecutor.executeGoals(DefaultLifecycleExecutor.java:579)
        at org.apache.maven.lifecycle.DefaultLifecycleExecutor.executeGoalWithLifecycle(DefaultLifecycleExecutor.java:499)
        at org.apache.maven.lifecycle.DefaultLifecycleExecutor.executeGoal(DefaultLifecycleExecutor.java:478)
        at org.apache.maven.lifecycle.DefaultLifecycleExecutor.executeGoalAndHandleFailures(DefaultLifecycleExecutor.java:330)
        at org.apache.maven.lifecycle.DefaultLifecycleExecutor.executeTaskSegments(DefaultLifecycleExecutor.java:291)
        at org.apache.maven.lifecycle.DefaultLifecycleExecutor.execute(DefaultLifecycleExecutor.java:142)
        at org.apache.maven.DefaultMaven.doExecute(DefaultMaven.java:336)
        at org.apache.maven.DefaultMaven.execute(DefaultMaven.java:129)
        at org.apache.maven.cli.MavenCli.main(MavenCli.java:287)
        at sun.reflect.NativeMethodAccessorImpl.invoke0(Native Method)
        at sun.reflect.NativeMethodAccessorImpl.invoke(NativeMethodAccessorImpl.java:39)
        at sun.reflect.DelegatingMethodAccessorImpl.invoke(DelegatingMethodAccessorImpl.java:25)
        at java.lang.reflect.Method.invoke(Method.java:585)
        at org.codehaus.classworlds.Launcher.launchEnhanced(Launcher.java:315)
        at org.codehaus.classworlds.Launcher.launch(Launcher.java:255)
        at org.codehaus.classworlds.Launcher.mainWithExitCode(Launcher.java:430)
        at org.codehaus.classworlds.Launcher.main(Launcher.java:375)
Caused by: org.apache.maven.plugin.MojoFailureException: There are test failures.

Please refer to /home/hudson/workspace/Jersey/jersey/jersey-tests/target/surefire-reports for the individual test results.
        at org.apache.maven.plugin.surefire.SurefirePlugin.execute(SurefirePlugin.java:530)
        at org.apache.maven.plugin.DefaultPluginManager.executeMojo(DefaultPluginManager.java:451)
        at org.apache.maven.lifecycle.DefaultLifecycleExecutor.executeGoals(DefaultLifecycleExecutor.java:558)
        ... 16 more
[INFO] ------------------------------------------------------------------------
[INFO] Total time: 45 minutes 48 seconds
[INFO] Finished at: Sat Jul 25 02:19:34 PDT 2009
[INFO] Final Memory: 65M/125M
[INFO] ------------------------------------------------------------------------