dev@grizzly.java.net

Re: com.sun.grizzly.ClientCacheTest FAILED

From: Oleksiy Stashok <Oleksiy.Stashok_at_Sun.COM>
Date: Fri, 20 Feb 2009 20:36:15 +0100

It should be fixed now.

Thanks.

On Feb 20, 2009, at 15:25 , Survivant 00 wrote:

> -------------------------------------------------------------------------------
> Test set: com.sun.grizzly.ClientCacheTest
> -------------------------------------------------------------------------------
> Tests run: 1, Failures: 1, Errors: 0, Skipped: 0, Time elapsed:
> 5.375 sec <<< FAILURE!
> testOutboutCacheSeveralPackets(com.sun.grizzly.ClientCacheTest)
> Time elapsed: 5.344 sec <<< FAILURE!
> junit.framework.ComparisonFailure: expected:<Hello. Client#1> but
> was:< >
> at junit.framework.Assert.assertEquals(Assert.java:81)
> at junit.framework.Assert.assertEquals(Assert.java:87)
> at
> com
> .sun
> .grizzly
> .ClientCacheTest.testOutboutCacheSeveralPackets(ClientCacheTest.java:
> 120)