See
http://kohsuke.sfbay/hudson/job/jaxws-test-harness/551/changes
Changes:
[Kohsuke Kawaguchi] implemented -version support.
------------------------------------------
started
[workspace] $ cvs -q -z3 update -PdC -D "Friday, September 21, 2007 6:19:23 PM UTC"
? test/testcases/jaxws/fromjava_handlers/work
P docs/src/index.html
U lib/emma-src.zip
U lib/emma.jar
U lib/istack-commons-runtime-src.zip
U lib/istack-commons-runtime.jar
U lib/istack-commons-test-src.zip
U lib/istack-commons-test.jar
P src/com/sun/xml/ws/test/Main.java
P src/com/sun/xml/ws/test/Realm.java
U src/com/sun/xml/ws/test/VersionNumberHandler.java
P src/com/sun/xml/ws/test/World.java
U src/com/sun/xml/ws/test/test-descriptor.rnc
U src/com/sun/xml/ws/test/client/AbstractXmlResource.java
U src/com/sun/xml/ws/test/client/InlineXmlResource.java
U src/com/sun/xml/ws/test/client/ReferencedXmlResource.java
U src/com/sun/xml/ws/test/client/XmlResource.java
P src/com/sun/xml/ws/test/container/WAR.java
P src/com/sun/xml/ws/test/container/invm/InVmApplication.java
P src/com/sun/xml/ws/test/container/invm/InVmContainer.java
P src/com/sun/xml/ws/test/container/jelly/sun-jaxws.bsh
U src/com/sun/xml/ws/test/emma/Emma.java
U src/com/sun/xml/ws/test/emma/InstrumentingClassLoader.java
P src/com/sun/xml/ws/test/exec/ClientExecutor.java
P src/com/sun/xml/ws/test/exec/ConcurrentClientExecutor.java
P src/com/sun/xml/ws/test/exec/DeploymentExecutor.java
P src/com/sun/xml/ws/test/exec/JavaClientExecutor.java
P src/com/sun/xml/ws/test/model/TestClient.java
P src/com/sun/xml/ws/test/model/TestDescriptor.java
P src/com/sun/xml/ws/test/model/TestEndpoint.java
P src/com/sun/xml/ws/test/model/TestService.java
P test/testcases/jaxws/twoServices/Bar.java
P test/testcases/jaxws/twoServices/Foo.java
P test/testcases/jaxws/twoServices/test.bsh
$ computing changelog
[workspace] $ /bin/bash -xe /mnt/ext-hdd/hudson/server/tomcat/temp/hudson69541.sh
+ ant -Dbuild.id=hudson-jaxws-test-harness-551 clean test
Buildfile: build.xml
clean:
[delete] Deleting directory /mnt/ext-hdd/hudson/server/jobs/jaxws-test-harness/workspace/build
compile:
[mkdir] Created dir: /mnt/ext-hdd/hudson/server/jobs/jaxws-test-harness/workspace/build/classes
[javac] Compiling 73 source files to /mnt/ext-hdd/hudson/server/jobs/jaxws-test-harness/workspace/build/classes
[javac] Note: Some input files use or override a deprecated API.
[javac] Note: Recompile with -Xlint:deprecation for details.
[javac] Note: Some input files use unchecked or unsafe operations.
[javac] Note: Recompile with -Xlint:unchecked for details.
[copy] Copying 7 files to /mnt/ext-hdd/hudson/server/jobs/jaxws-test-harness/workspace/build/classes
jar:
[jar] Building jar: /mnt/ext-hdd/hudson/server/jobs/jaxws-test-harness/workspace/build/test-harness-core.jar
src-zip:
[jar] Building jar: /mnt/ext-hdd/hudson/server/jobs/jaxws-test-harness/workspace/build/test-harness-core-src.zip
dist:
compile:
jar:
[jar] Building jar: /mnt/ext-hdd/hudson/server/jobs/jaxws-test-harness/workspace/bootstrap/build/bootstrap.jar
src-zip:
dist:
doc:
[htmlmacro] Processing /mnt/ext-hdd/hudson/server/jobs/jaxws-test-harness/workspace/docs/src/index.html
[copy] Copying 1 file to /mnt/ext-hdd/hudson/server/jobs/jaxws-test-harness/workspace/docs/build
[mkdir] Created dir: /mnt/ext-hdd/hudson/server/jobs/jaxws-test-harness/workspace/build/dist
[copy] Copying 1 file to /mnt/ext-hdd/hudson/server/jobs/jaxws-test-harness/workspace/build/dist
[copy] Copying 1 file to /mnt/ext-hdd/hudson/server/jobs/jaxws-test-harness/workspace/build/dist
[zip] Building zip: /mnt/ext-hdd/hudson/server/jobs/jaxws-test-harness/workspace/build/dist/harness-lib.jar
[zip] Building zip: /mnt/ext-hdd/hudson/server/jobs/jaxws-test-harness/workspace/build/dist/harness-lib.src.zip
[copy] Copying 3 files to /mnt/ext-hdd/hudson/server/jobs/jaxws-test-harness/workspace/build/dist
[zip] Building zip: /mnt/ext-hdd/hudson/server/jobs/jaxws-test-harness/workspace/build/test-harness.zip
test:
[get] Getting:
http://kohsuke.sfbay/hudson/job/jaxws-ri-rearch-2005/lastSuccessfulBuild/artifact/jax-ws-sources/jaxws-ri/build/jaxws-ri.zip
[get] To: /mnt/ext-hdd/hudson/server/jobs/jaxws-test-harness/workspace/build/jaxws-ri.zip
[unzip] Expanding: /mnt/ext-hdd/hudson/server/jobs/jaxws-test-harness/workspace/build/jaxws-ri.zip into /mnt/ext-hdd/hudson/server/jobs/jaxws-test-harness/workspace/build
[get] Getting:
http://kohsuke.sfbay/hudson/job/jaxws-ri-rearch-2005/lastSuccessfulBuild/artifact/jax-ws-sources/jaxws-ri/transports/local/build/jaxws-local-transport.jar
[get] To: /mnt/ext-hdd/hudson/server/jobs/jaxws-test-harness/workspace/build/jaxws-local-transport.jar
[java] Exception in thread "main" java.lang.reflect.InvocationTargetException
[java] at sun.reflect.NativeMethodAccessorImpl.invoke0(Native Method)
[java] at sun.reflect.NativeMethodAccessorImpl.invoke(NativeMethodAccessorImpl.java:39)
[java] at sun.reflect.DelegatingMethodAccessorImpl.invoke(DelegatingMethodAccessorImpl.java:25)
[java] at java.lang.reflect.Method.invoke(Method.java:585)
[java] at com.sun.xml.ws.test.Bootstrap.main(Bootstrap.java:64)
[java] Caused by: org.kohsuke.args4j.IllegalAnnotationError: java.lang.IllegalAccessException: Class org.kohsuke.args4j.CmdLineParser can not access a member of class com.sun.xml.ws.test.VersionNumberHandler with modifiers "public"
[java] at org.kohsuke.args4j.CmdLineParser.createOptionHandler(CmdLineParser.java:157)
[java] at org.kohsuke.args4j.CmdLineParser.addOption(CmdLineParser.java:123)
[java] at org.kohsuke.args4j.CmdLineParser.<init>(CmdLineParser.java:97)
[java] at com.sun.xml.ws.test.Main.doMain(Main.java:194)
[java] at com.sun.xml.ws.test.Main.main(Main.java:189)
[java] ... 5 more
[java] Caused by: java.lang.IllegalAccessException: Class org.kohsuke.args4j.CmdLineParser can not access a member of class com.sun.xml.ws.test.VersionNumberHandler with modifiers "public"
[java] at sun.reflect.Reflection.ensureMemberAccess(Reflection.java:65)
[java] at java.lang.reflect.Constructor.newInstance(Constructor.java:486)
[java] at org.kohsuke.args4j.CmdLineParser.createOptionHandler(CmdLineParser.java:153)
[java] ... 9 more
[java] Java Result: 1
[mkdir] Created dir: /mnt/ext-hdd/hudson/server/jobs/jaxws-test-harness/workspace/build/junit-reports
BUILD FAILED
/mnt/ext-hdd/hudson/server/jobs/jaxws-test-harness/workspace/build.xml:195: /mnt/ext-hdd/hudson/server/jobs/jaxws-test-harness/workspace/build/test-logs not found.
Total time: 48 seconds
Recording fingerprints
Recording test results
No test report files were found. Configuration error?